{"text_format":"1","workbook":"xlsx","n_sheets":3,"sheets":["Abfrage","Rechner","Text"],"not_rendered":{"charts":0,"images":0,"macros":1,"external_links":0,"defined_names":150,"comments":0,"pivot_tables":0},"unopened":[],"bounds":{"document_bytes":16777216,"sheet_cells":100000,"rows_first":2000,"rows_last":500,"rows_between":2000,"halvings":0,"cell_chars":16384,"cell_head_chars":4096},"cells_cut":0,"cells_raw":0,"read":"whole","date_system":"1900"}

{"sheet":"Abfrage","index":0,"n_rows":325,"n_cols":25,"rows_kept":325,"cut":false,"hidden":false,"merged":[[164,6,164,7],[64,0,64,9],[127,6,127,7],[112,0,112,9],[122,0,122,4],[136,0,136,4],[114,0,114,9],[115,7,115,9],[116,0,116,9],[123,0,123,9],[113,0,113,9],[118,0,118,3],[159,0,159,3],[157,0,157,3],[156,0,156,3],[150,0,150,5],[144,6,144,9],[145,6,145,9],[147,5,147,9],[156,6,156,9],[157,6,157,9],[153,0,153,9],[154,0,154,9],[102,0,102,9],[203,0,203,9],[204,5,204,9],[20,0,20,2],[21,0,21,2],[20,3,20,5],[21,3,21,5],[20,6,20,7],[19,8,21,9],[19,5,19,7],[21,6,21,7],[197,7,197,9],[134,0,134,9],[135,0,135,9],[108,0,108,9],[118,5,118,9],[119,0,119,9],[197,0,197,4],[168,0,168,9],[174,0,174,9],[107,7,107,9],[84,7,84,9],[62,0,62,9],[65,0,65,5],[163,6,163,7],[218,0,218,9],[219,5,219,9],[220,5,220,9],[221,5,221,9],[222,5,222,9],[223,5,223,9],[224,5,224,9],[225,0,225,9],[216,0,216,9],[220,0,220,3],[221,0,221,3],[222,0,222,3],[223,0,223,3],[224,0,224,3],[217,0,217,9],[219,0,219,3],[199,6,199,9],[181,5,181,9],[200,6,200,9],[182,8,184,9],[210,0,210,3],[215,5,215,9],[208,0,208,3],[209,0,209,3],[205,0,205,9],[212,0,212,3],[214,5,214,9],[213,0,213,3],[214,0,214,3],[215,0,215,3],[209,5,209,9],[210,5,210,9],[206,0,206,9],[213,5,213,9],[211,5,211,9],[212,5,212,9],[208,5,208,9],[207,0,207,9],[211,0,211,3],[204,0,204,3],[175,0,175,9],[178,0,178,9],[176,0,176,9],[183,5,183,7],[184,5,184,7],[182,5,182,7],[199,0,199,4],[200,0,200,4],[201,0,201,9],[177,7,177,9],[185,5,185,9],[186,5,186,9],[182,2,182,3],[183,2,183,3],[184,2,184,3],[181,0,181,1],[187,0,187,9],[190,7,190,9],[192,5,192,9],[191,0,191,9],[179,5,179,9],[180,5,180,9],[188,0,188,9],[198,0,198,9],[179,0,179,4],[181,2,181,3],[190,0,190,4],[192,0,192,4],[182,0,182,1],[183,0,183,1],[184,0,184,1],[185,0,185,1],[186,0,186,1],[8,0,8,9],[9,0,9,9],[10,0,10,9],[24,0,24,9],[29,5,29,9],[30,3,30,9],[31,5,31,9],[42,6,42,9],[43,6,43,9],[16,0,16,1],[17,0,17,1],[15,0,15,1],[16,3,16,7],[22,0,22,9],[19,0,19,4],[38,0,38,9],[26,0,28,1],[31,2,31,4],[26,2,28,6],[32,0,32,9],[39,0,39,9],[25,2,25,6],[29,0,29,1],[17,5,17,7],[109,0,109,6],[155,0,155,9],[148,5,148,9],[149,0,149,9],[150,7,150,9],[147,3,147,4],[146,0,146,9],[148,3,148,4],[147,0,147,2],[148,0,148,2],[125,6,125,9],[69,7,69,9],[70,0,70,9],[98,4,98,5],[91,0,91,9],[87,7,87,9],[88,7,88,9],[158,0,158,3],[151,0,151,9],[152,0,152,9],[136,7,136,9],[120,5,120,9],[121,0,121,9],[130,6,130,9],[117,5,117,9],[110,0,110,9],[111,7,111,9],[106,0,106,9],[111,0,111,5],[107,0,107,5],[104,0,104,4],[90,6,90,9],[99,0,99,9],[97,0,97,9],[117,0,117,3],[33,0,33,3],[34,3,34,5],[35,3,35,5],[57,0,57,9],[96,7,96,9],[98,7,98,9],[138,0,138,5],[89,0,89,9],[98,0,98,1],[83,1,83,5],[84,1,84,5],[85,1,85,5],[87,1,87,5],[67,0,67,9],[79,0,79,9],[83,7,83,9],[71,7,71,9],[85,7,85,9],[86,7,86,9],[120,0,120,3],[124,6,124,9],[122,7,122,9],[75,1,75,3],[68,0,68,9],[40,0,40,9],[41,0,41,9],[49,6,49,9],[58,0,58,1],[53,6,53,9],[44,6,44,9],[34,0,34,2],[35,0,35,2],[36,0,36,2],[37,0,37,2],[82,0,82,9],[71,0,71,3],[80,0,80,9],[81,0,81,9],[73,1,73,3],[36,3,36,5],[37,3,37,5],[34,8,37,9],[34,6,34,7],[35,6,35,7],[36,6,36,7],[37,6,37,7],[66,0,66,9],[65,6,65,7],[65,8,65,9],[60,2,60,6],[54,6,54,9],[59,0,59,1],[60,0,60,1],[45,6,45,7],[46,6,46,7],[42,0,54,5],[50,6,50,9],[51,6,51,9],[23,0,23,9],[18,0,18,9],[11,2,11,6],[58,2,58,6],[15,2,15,4],[78,0,78,9],[76,1,76,3],[74,1,74,3],[29,2,29,4],[56,0,56,9],[55,0,55,9],[33,5,33,9],[63,0,63,9],[61,0,61,9],[59,2,59,6],[17,2,17,4],[30,0,30,1],[47,6,47,7],[48,6,48,7],[15,5,15,7],[31,0,31,1],[25,0,25,1],[12,2,14,6],[52,6,52,9],[229,7,229,9],[230,7,230,9],[231,7,231,9],[227,0,227,9],[226,0,226,9],[0,0,0,6],[1,0,1,6],[6,0,6,6],[98,2,98,3],[77,1,77,3],[72,1,72,3],[11,0,11,1],[95,6,95,9],[12,0,14,1],[96,2,96,3],[86,1,86,5],[95,0,95,5],[96,4,96,5],[88,1,88,5],[96,0,96,1],[94,0,94,9],[92,0,92,9],[93,0,93,9],[7,0,7,9],[100,0,100,5],[103,0,103,9],[104,7,104,9],[105,0,105,9],[109,7,109,9],[115,0,115,6],[124,0,124,5],[143,6,143,7],[128,6,128,7],[129,6,129,7],[100,7,100,9],[141,6,141,7],[142,6,142,7],[137,0,137,9],[138,6,138,9],[139,6,139,9],[140,6,140,7],[125,0,132,5],[133,0,133,9],[131,6,131,9],[132,6,132,9],[126,6,126,7],[139,0,145,5],[101,0,101,9],[160,0,160,3],[165,0,165,3],[164,0,164,3],[189,0,189,9],[186,2,186,3],[169,0,169,9],[170,0,170,9],[171,0,171,3],[171,5,171,9],[172,0,172,3],[172,5,172,9],[177,0,177,4],[185,2,185,3],[173,0,173,3],[165,6,165,9],[166,0,166,9],[158,8,160,9],[162,8,164,9],[158,6,158,7],[159,6,159,7],[160,6,160,7],[162,6,162,7],[167,0,167,9],[173,5,173,9],[256,6,256,9],[248,1,248,5],[250,1,250,5],[252,1,252,5],[256,1,256,5],[257,1,257,5],[162,0,162,3],[161,6,161,9],[202,0,202,9],[194,0,194,9],[195,0,195,9],[196,0,196,9],[161,0,161,3],[163,0,163,3],[193,0,193,4],[228,0,230,6],[240,6,240,9],[242,0,242,9],[235,6,235,9],[236,6,236,9],[241,6,241,9],[232,7,234,9],[237,7,239,9],[228,7,228,9],[269,0,269,9],[271,0,271,3],[278,7,281,9],[257,6,257,9],[275,7,275,9],[262,7,262,9],[266,0,266,4],[267,0,267,4],[274,0,274,9],[277,0,277,9],[273,0,273,9],[275,0,275,6],[276,0,276,6],[276,7,276,9],[264,0,264,9],[267,6,267,7],[266,6,266,7],[263,0,263,9],[265,0,265,7],[260,0,260,9],[270,0,270,9],[271,5,271,9],[272,0,272,9],[261,0,261,9],[268,0,268,9],[262,0,262,6],[249,6,249,9],[259,0,259,9],[258,0,258,9],[243,0,243,9],[245,0,245,3],[251,6,251,9],[246,0,246,7],[244,0,244,9],[247,6,247,7],[248,6,248,9],[249,1,249,5],[251,1,251,5],[255,1,255,5],[253,1,253,5],[253,6,253,9],[250,6,250,9],[245,4,245,5],[254,6,254,9],[255,6,255,9],[252,6,252,9],[254,1,254,5],[247,0,247,5]]}
["Berechnungsformular zur Erstellung des Architektenvertrages"]
[]
["1. Stellen Sie sicher, dass sich diese Datei und die Datei \"2-AV.docx\" im selben Ordner befinden."]
["2. Füllen Sie die gelben Felder in diesem Formular aus."]
["3. Klicken Sie am Ende des Formulars auf \"Architektenvertrag erstellen\". Die Berechnungen aus"]
["diesem Formular werden in den als Word-Datei generierten Architektenvertrag übernommen."]
[]
["1. Informationen zum Bauherrn und zum Architekten"]
[]
["a) Bauherr"]
[]
["Name des Bauherrn:"]
["vertreten durch:"]
[]
[]
["Straße:"]
["PLZ:"]
["Ort:"]
[]
["Ansprechpartner des Bauherrn für den Architekten"]
["Name:"]
["Telefonnummer:"]
[]
["b) Architekt"]
[]
["Name d. Architekten:"]
["vertreten durch:"]
[]
[]
["Straße:"]
["PLZ:"]
["Ort:"]
[]
["Projektleiter und Stellvertreter"]
["Name des Projektleiters:"]
["Telefonnummer:"]
["Name des Stellvertreters:"]
["Telefonnummer:"]
[]
["2. Angaben zum Vertragsgegenstand"]
[]
["a) Geben Sie hier eine kurze Objekt- und Maßnahmenbeschreibung ein:"]
[]
[]
[]
[]
[]
[]
[]
[]
[]
[]
[]
[]
[]
[]
["b) Grundbuchbezogene Angaben"]
[]
["Gemarkung:"]
["Flur:"]
["Flurstück:"]
[]
["3. Angaben zur Baukostenobergrenze"]
[]
["Das Budget enthält sämtliche Baukosten (KG 200 – KG 600 gemäß DIN 276: 2018-12)."]
["Dem Bauherrn steht ein maximales Budget in folgender Höhe (netto) zur Verfügung:"]
[]
["4. Berechnung der anrechenbaren Baukosten"]
[]
["a) Geben Sie die die Kosten inklusive MwSt. nach Kostengruppen getrennt ein:"]
[]
[null,null,null,null,"brutto",null,"netto"]
["KG 200","Vorbereitende Maßnahmen*)",null,null,null,null,{"$f":"IF(E73<>\"\",ROUND(E73/1.19,2),\"\")","v":""}]
["KG 300","Bauwerk - Baukonstruktion",null,null,null,null,{"$f":"IF(E74<>\"\",ROUND(E74/1.19,2),\"\")","v":""}]
["KG 400","Bauwerk - Technische Anlagen",null,null,null,null,{"$f":"IF(E75<>\"\",ROUND(E75/1.19,2),\"\")","v":""}]
["KG 500","Außenanlagen u. Freiflächen*)",null,null,null,null,{"$f":"IF(E76<>\"\",ROUND(E76/1.19,2),\"\")","v":""}]
["KG 600","Ausstattung und Kunstwerke*)",null,null,null,null,{"$f":"IF(E77<>\"\",ROUND(E77/1.19,2),\"\")","v":""}]
[null,"Gesamtkosten",null,null,{"$f":"SUM(E73:E77)","v":0},null,{"$f":"SUM(G73:H77)","v":0}]
[]
["*) Nur anrechenbar, soweit der Architekt insoweit plant o. bei der Beschaffung mitwirkt o. Ausführung o. Einbau fachlich überwacht."]
[]
[" b) Anrechenbare Kosten nach DIN 276-1: 2008-12 (§ 33 Abs. 1 HOAI)"]
[]
[null,null,null,null,null,null,"netto"]
["KG 200","Vorbereitende Maßnahmen",null,null,null,null,{"$f":"IF((G73<>\"\"),G73,0)","v":0}]
["KG 300","Bauwerk - Baukonstruktion",null,null,null,null,{"$f":"IF((G74<>\"\"),G74,0)","v":0}]
["KG 500","Außenanlagen u. Freiflächen",null,null,null,null,{"$f":"IF((G76<>\"\"),G76,0)","v":0}]
["KG 600","Ausstattung und Kunstwerke",null,null,null,null,{"$f":"IF((G77<>\"\"),G77,0)","v":0}]
[null,"Summe",null,null,null,null,{"$f":"SUM(G85:G88)","v":0}]
[]
["c) Besondere Grundlagen des Honorars gem. § 33 Abs. 2 HOAI"]
[]
["Anrechenbar für Leistungen bei Gebäuden und raumbildenden Ausbauten sind die Kosten für Technische"]
["Anlagen, die der Auftragnehmer nicht fachlich plant oder deren Ausführung er nicht fachlich überwacht,"]
[]
["aa) vollständig bis zu 25 % der sonstigen anrechenbaren Kosten: "]
["max. 25 % von",null,{"$f":"IF(G75<>\"\",G89,\"-- entfällt --\")","v":"-- entfällt --"},null,"=",null,{"$f":"IF(C97<>\"-- entfällt --\",ROUND(C97*25%,2),0)","v":0}]
[]
["Kostengruppe 400:",null,{"$f":"IF(G75<>\"\",G75,\"-- entfällt --\")","v":"-- entfällt --"},null,"davon voll anrechenbar",null,{"$f":"IF(C99<=G97,C99,G97)","v":0}]
[]
["bb) zur Hälfte mit dem 25 % der sonst. anrechenb. Kosten übersteigend. Betrag:",null,null,null,null,null,{"$f":"IF((C99>G97),ROUND(((C99-G97)*50%),2),0)","v":{"$error":"#VALUE!"}}]
[]
["d) Mitzuverarbeitende Bausubstanz gem. § 4 Abs. 3 HOAI"]
[]
["Gibt es berücksichtigungsfähige mitzuverarbeitende Bausubstanz?",null,null,null,null,null,"nein"]
[]
["Der Umfang und der Wert der mitzuverarbeitenden Bausubstanz, der bei den anrechenbaren Kosten"]
["angemessen zu berücksichtigen ist, wird mit folgendem Betrag angegeben:"]
[]
["e) Summe"]
[]
["Summe der anrechenbaren Kosten:",null,null,null,null,null,{"$f":"SUM(G101,G99,G89,G108)","v":{"$error":"#VALUE!"}}]
[]
["5. Honorarzone und Honorarsatz"]
[]
["a) Wählen Sie zwischen Honorarzone I bis V aus sowie zwischen Mindest- und Mittelsatz."]
[]
["Honorarzone:",null,null,null,"hier klicken"]
["Honorarsatz:",null,null,null,"hier klicken"]
[]
["Netto-Honorar bei 100 % (LP 1 - LP 9):",null,null,null,{"$f":"IF((OR(AND(G112<25000,G112>0),G112>25000000)),\"frei vereinbar\",IF(E119=\"Mindestsatz\",Rechner!O19,IF(E119=\"Viertelsatz\",Rechner!O20,IF(E119=\"Mittelsatz\",Rechner!O21,IF(E119=\"Dreiviertelsatz\",Rechner!O22,IF(E119=\"Höchstsatz\",Rechner!O23,\"\"))))))","v":{"$error":"#VALUE!"}}]
[]
["b) Honorarzone wegen Schwierigkeiten erhöht?",null,null,null,null,null,"nein"]
[]
[{"$f":"IF(G123=\"nein\",\"Es erfolgt keine Erhöhung der Honorarzone.\",\"Die Erhöhung der Honorarzone wird mit folgenden Schwierigkeiten begründet:\")","v":"Es erfolgt keine Erhöhung der Honorarzone."}]
[]
[]
[]
[]
[]
[]
[]
[]
[]
["6. Zuschlag für Umbau und Modernisierung"]
[]
["Zuschlag gemäß § 36 HOAI in Höhe von bis zu 20 %?",null,null,null,null,null,"nein"]
[]
[{"$f":"IF(G137=\"ja\",\"Begründung und Vereinbarung des Zuschlags\",\"Es wird kein Zuschlag vereinbart.\")","v":"Es wird kein Zuschlag vereinbart."}]
[]
[]
[]
[]
[]
[]
[]
[]
["Höhe des Zuschlags (%):",null,null,0.12]
["Umbauzuschlag Betrag:",null,null,{"$f":"ROUND(E121*D148,2)","v":{"$error":"#VALUE!"}}]
[]
["Netto-Honorar bei 100% gesamt:",null,null,null,null,null,{"$f":"SUBTOTAL(109,E121,D149)","v":{"$error":"#VALUE!"}}]
[]
["7. Grundleistungen"]
[]
["Wählen Sie die Leistungsphasen aus, zu denen Grundleistungen beauftragt werden sollen:"]
[]
["LP 1 - Grundlagenermittlung - 2 %",null,null,null,null,{"$f":"ROUND(G151*E157,2)","v":{"$error":"#VALUE!"}}]
["LP 2 - Vorplanung - 7 %",null,null,null,null,{"$f":"ROUND(G151*E158,2)","v":{"$error":"#VALUE!"}}]
["LP 3 - Entwurfsplanung - 15 %",null,null,null,null,{"$f":"ROUND(G151*E159,2)","v":{"$error":"#VALUE!"}}]
["LP 4 - Genehmigungsplanung - 3 %",null,null,null,null,{"$f":"ROUND(G151*E160,2)","v":{"$error":"#VALUE!"}}]
["LP 5 - Ausführungsplanung - 25 %",null,null,null,null,{"$f":"ROUND(G151*E161,2)","v":{"$error":"#VALUE!"}}]
["LP 6 - Vorbereitung der Vergabe - 10 %",null,null,null,null,{"$f":"ROUND(G151*E162,2)","v":{"$error":"#VALUE!"}}]
["LP 7 - Mitwirkung bei Vergabe - 4 %",null,null,null,null,{"$f":"ROUND(G151*E163,2)","v":{"$error":"#VALUE!"}}]
["LP 8 - Objektüberwachung - 32 %",null,null,null,null,{"$f":"ROUND(G151*E164,2)","v":{"$error":"#VALUE!"}}]
["LP 9 - Objektbetreuung - 2 %",null,null,null,null,{"$f":"ROUND(G151*E165,2)","v":{"$error":"#VALUE!"}}]
["Honorarsumme Grundleistungen gesamt",null,null,null,{"$f":"SUBTOTAL(109,E157:E165)","v":0},{"$f":"SUBTOTAL(109,F157:F165)","v":{"$error":"#VALUE!"}}]
[]
["8. Nebenkosten"]
[]
["Hier können Sie die Höhe des Nebenkostensatzes (in Prozent bezogen auf das Nettohonorar der Grundleistungen festlegen:"]
[]
["a) Nebenkostensatz in %:"]
["Netto-Honorar Grundleistungen:",null,null,null,{"$f":"GL_Honorar_gesamt_1","v":{"$error":"#VALUE!"}}]
["Nebenkostenbetrag netto:",null,null,null,{"$f":"ROUND(E172*E173,2)","v":{"$error":"#VALUE!"}}]
[]
["9. Pauschalhonorar für Grundleistungen und Nebenkosten"]
[]
["Pauschalhonorar für Grundleistungen und Nebenkosten?",null,null,null,null,null,"nein"]
[]
[{"$f":"IF(G178=\"ja\",\"Vereinbarung Pauschalhonorar auf Grundlage von Orientierungswerten:\",\"Es wird KEIN Pauschalhonorar vereinbart.\")","v":"Es wird KEIN Pauschalhonorar vereinbart."}]
[]
[null,null,"HOAI",null,"freie Pauschale"]
["Stufe I (LP 1 bis 4):",null,{"$f":"SUM(F157:F160)","v":{"$error":"#VALUE!"}}]
["Stufe II (LP 5 bis 7):",null,{"$f":"SUM(F161:F163)","v":{"$error":"#VALUE!"}}]
["Stufe III (LP 8 & 9):",null,{"$f":"SUM(F164:F165)","v":{"$error":"#VALUE!"}}]
["Nebenkosten:",null,{"$f":"E174","v":{"$error":"#VALUE!"}}]
["Summe netto:",null,{"$f":"SUM(C183:D186)","v":{"$error":"#VALUE!"}},null,{"$f":"SUM(E183:G186)","v":0}]
[]
["10. Pauschalhonorar für Besondere Leistungen"]
[]
["Es werden Besondere Leistungen beauftragt?",null,null,null,null,null,"nein"]
[]
[{"$f":"IF(G191=\"ja\",\"Das Netto-Honorar für alle Besonderen Leistungen beträgt pauschal:\",\"Es werden KEINE Besonderen Leistungen beauftragt.\")","v":"Es werden KEINE Besonderen Leistungen beauftragt."}]
["Summe netto:"]
[]
["11. Pauschalhonorar für Beratungsleistungen"]
[]
["Es werden Sonstige Leistungen (z. B. Beratung) beauftragt?",null,null,null,null,null,"nein"]
[]
[{"$f":"IF(G198=\"ja\",\"Das Netto-Honorar für alle Beratungsleistungen beträgt pauschal:\",\"Es werden KEINE Beratungsleistungen beauftragt.\")","v":"Es werden KEINE Beratungsleistungen beauftragt."}]
["Summe netto:"]
[]
["12. Mehrwertsteuer"]
[]
["Mehrwertsteuersatz:",null,null,null,0.19]
[]
["13. Berechnung des Gesamthonorars nach HOAI"]
[]
["Honorarsumme Grundleistungen netto:",null,null,null,{"$f":"F166","v":{"$error":"#VALUE!"}}]
["Nebenkosten netto:",null,null,null,{"$f":"E174","v":{"$error":"#VALUE!"}}]
["Zwischensumme:",null,null,null,{"$f":"SUM(E209,E210)","v":{"$error":"#VALUE!"}}]
["Honorarsumme Besondere Leistungen netto:",null,null,null,{"$f":"IF(G191=\"ja\",F194,\"0\")","v":"0"}]
["Honorarsumme Beratungsleistungen netto:",null,null,null,{"$f":"IF(G198=\"ja\",F201,\"0\")","v":"0"}]
["Honorarsumme gesamt netto:",null,null,null,{"$f":"SUM(E211,E212,E213)","v":{"$error":"#VALUE!"}}]
["Mehrwertsteuerbetrag:",null,null,null,{"$f":"Gesamthonorar_netto*MwSt_Prozent","v":{"$error":"#VALUE!"}}]
["Gesamthonorar brutto:",null,null,null,{"$f":"SUM(E214:E215)","v":{"$error":"#VALUE!"}}]
[]
["14. Berechnung des Gesamt-Pauschalhonorars"]
[]
["Honorarsumme Grundleistungen + NK netto:",null,null,null,{"$f":"E187","v":0}]
["Honorarsumme Besondere Leistungen netto:",null,null,null,{"$f":"IF(G191=\"ja\",F194,\"0\")","v":"0"}]
["Honorarsumme Beratungsleistungen netto:",null,null,null,{"$f":"IF(G198=\"ja\",F201,\"0\")","v":"0"}]
["Honorarsumme gesamt netto:",null,null,null,{"$f":"SUM(E220:E222)","v":0}]
["Mehrwertsteuerbetrag:",null,null,null,{"$f":"E223*MwSt_Prozent","v":0}]
["Pauschal-Gesamthonorar brutto:",null,null,null,{"$f":"SUM(E223:E224)","v":0}]
[]
["15. Herauszugebende Planunterlagen"]
[]
["Der Architekt kommuniziert alle Plan- und sonstigen Unterlagen in kompatiblen EDV-Daten. Daneben ist der Architekt verpflichtet, sämtliche Unterlagen dem Bauherrn in folgender Ausfertigung vorzulegen. Neben jeweils 2-facher Papierform (zzgl. der Ausfertigung der Anträge), sind die Ausschreibungen in folgenden Daten zu übergeben:"]
[]
[]
[]
["LP","CAD","DAF (gaeb)","Excel","pdf","dwg/ dxf",null,null,null,null,null,null,null,null,null,null,null,null,null,null,null,null,null,null,"x"]
[1]
[2]
[3]
[4]
[5]
[6]
[7]
[8]
[9]
[]
["16. Fachplaner, bildende Künstler, Sonderfachleute"]
[]
["Wieviele Leistungen sind einzutragen?",null,null,null,null,null,"keine"]
[]
[{"$f":"IF(G246=\"keine\",\"Es werden keine Leistungen durch Fachplaner/bild. Künstler/Sonderfachleute erbracht.\",\"Folgende Leistungen werden durch Fachplaner/bild. Künstler, Sonderfachplaner erbracht:\")","v":"Es werden keine Leistungen durch Fachplaner/bild. Künstler/Sonderfachleute erbracht."}]
["Leistung 1"]
["Planer 1"]
["Leistung 2"]
["Planer 2"]
["Leistung 3"]
["Planer 3"]
["Leistung 4"]
["Planer 4"]
["Leistung 5"]
["Planer 5"]
[]
["17. SiGeKO"]
[]
["Leistungen aus dem Bereich SiGeKo werden erbracht durch:"]
[]
[]
["18. Haftpflichtversicherung"]
[""]
["a) Deckungsumme für Personenschäden:"]
["b) Deckungssumme für Sach- und sonstige Schäden:"]
[]
["19. Honorarangebot"]
[]
["Datum des Honorarangebotes des Architekten:"]
[]
["20. Architektenvertrag erstellen"]
[]
["Klicken Sie auf den Button \"Architektenvertrag erstellen\" um die Daten aus dieser Berechnung in den"]
["Architektenvertrag zu übernehmen."]
[]
[]
[]
[]
[]
[]
[]
[]
[]
[]
[]
[]
[]
[]
[]
[]
[]
[]
[]
[]
[]
[]
[]
[]
[]
[]
[]
[]
[]
[]
[]
[]
[]
[]
[]
[]
[]
[]
[]
[]
[]
[]
[]
[]
[]
[]
[]
[null,null,null,null,null,null,2]

{"sheet":"Rechner","index":1,"n_rows":29,"n_cols":17,"rows_kept":29,"cut":false,"hidden":true,"merged":[[14,12,14,13],[18,12,18,13],[15,12,15,13],[9,12,9,13],[10,12,10,13],[11,12,11,13],[13,12,13,13],[26,12,26,13],[27,12,27,13],[28,12,28,13],[19,12,19,13],[21,12,21,13],[22,12,22,13],[25,12,25,13],[20,12,20,13],[6,12,7,14],[0,9,0,10],[0,1,0,2],[0,3,0,4],[0,5,0,6],[0,7,0,8]]}
[null,"Zone I",null,"Zone II",null,"Zone III",null,"Zone IV",null,"Zone V"]
["anrechb. K.","Min-I","Max-I","Min-II","Max-II","Min-III","Max-III","Min-IV","Max-IV","Min-V","Max-V"]
[0,0,0,0,0,0,0,0,0,0,0]
[25000,3120,3657,3657,4339,4339,5412,5412,6094,6094,6631,null,"anrechb. K.",{"$f":"Abfrage!G112","v":{"$error":"#VALUE!"}}]
[35000,4217,4942,4942,5865,5865,7315,7315,8237,8237,8962,null,"Zone:",{"$f":"Abfrage!E118","v":"hier klicken"}]
[50000,5804,6801,6801,8071,8071,10066,10066,11336,11336,12333]
[75000,8342,9776,9776,11601,11601,14469,14469,16293,16293,17727]
[100000,10790,12644,12644,15005,15005,18713,18713,21074,21074,22928]
[150000,15500,18164,18164,21555,21555,26883,26883,30274,30274,32938]
[200000,20037,23480,23480,27863,27863,34751,34751,39134,39134,42578,null,"nächstniedriger Tabellenwert:",null,{"$f":"INDEX(Kosten,COUNTIF(Kosten,\"<\"&N4)+1)","v":"anrechb. K."},null,"Spalte:"]
[300000,28750,33692,33692,39981,39981,49864,49864,56153,56153,61095,null,"Mindestsatz:",null,{"$f":"VLOOKUP(O$10,A$3:K$32,Q11)","v":{"$error":"#N/A"}},null,{"$f":"IF(N5=\"I\",2,IF(N5=\"II\",4,IF(N5=\"III\",6,IF(N5=\"IV\",8,IF(N5=\"V\",10,\"?\")))))","v":"?"}]
[500000,45232,53006,53006,62900,62900,78449,78449,88343,88343,96118,null,"Höchstsatz:",null,{"$f":"VLOOKUP(O$10,A$3:K$32,Q12)","v":{"$error":"#N/A"}},null,{"$f":"IF(N5=\"I\",3,IF(N5=\"II\",5,IF(N5=\"III\",7,IF(N5=\"IV\",9,IF(N5=\"V\",11,\"?\")))))","v":"?"}]
[750000,64666,75781,75781,89927,89927,112156,112156,126301,126301,137416]
[1000000,83182,97479,97479,115675,115675,144268,144268,162464,162464,176761,null,"nächsthöherer Tabellenwert:",null,{"$f":"INDEX(Kosten,COUNTIF(Kosten,\"<\"&N4)+2)","v":0}]
[1500000,119307,139813,139813,165911,165911,206923,206923,233022,233022,253527,null,"Mindestsatz:",null,{"$f":"VLOOKUP(O$14,A$3:K$32,Q11)","v":{"$error":"#REF!"}}]
[2000000,153965,180428,180428,214108,214108,267034,267034,300714,300714,327177,null,"Höchstsatz:",null,{"$f":"VLOOKUP(O$14,A$3:K$32,Q12)","v":{"$error":"#REF!"}}]
[3000000,220161,258002,258002,306162,306162,381843,381843,430003,430003,467843]
[5000000,343879,402984,402984,478207,478207,596416,596416,671640,671640,730744]
[7500000,493923,578816,578816,686862,686862,856648,856648,964694,964694,1049587,null,"Interpolierter Mindestsatz:",null,{"$f":"ROUND((O11+((N4-O10)*(O15-O11))/(O14-O10)),2)","v":{"$error":"#N/A"}}]
[10000000,638277,747981,747981,887604,887604,1107012,1107012,1246635,1246635,1356339,null,"Interpolierter Viertelsatz:",null,{"$f":"O27+Q27","v":{"$error":"#N/A"}}]
[15000000,915129,1072416,1072416,1272601,1272601,1587176,1587176,1787360,1787360,1944648,null,"Interpolierter Mittelsatz:",null,{"$f":"O28+Q28","v":{"$error":"#N/A"}}]
[20000000,1180414,1383298,1383298,1641513,1641513,2047281,2047281,2305496,2305496,2508380,null,"Interpolierter Dreiviertelsatz:",null,{"$f":"O29+Q29","v":{"$error":"#N/A"}}]
[25000000,1436874,1683837,1683837,1998153,1998153,2492079,2492079,2806395,2806395,3053358,null,"Interpolierter Höchstsatz",null,{"$f":"ROUND((O12+((N4-O10)*(O16-O12))/(O14-O10)),2)","v":{"$error":"#N/A"}}]
[]
[]
[null,null,null,null,null,null,null,null,null,null,null,null,"Satzberechnung",null,"Wert A","Wert B","Wert C"]
[null,null,null,null,null,null,null,null,null,null,null,null,"Viertelsatz",null,{"$f":"ROUND($O$11+(($O$12-$O$11)*25/100),2)","v":{"$error":"#N/A"}},{"$f":"ROUND($O$15+(($O$16-$O$15)*25/100),2)","v":{"$error":"#REF!"}},{"$f":"ROUND(((P27-O27)*($N$4-$O$10))/($O$14-$O$10),2)","v":{"$error":"#REF!"}}]
[null,null,null,null,null,null,null,null,null,null,null,null,"Mittelsatz",null,{"$f":"ROUND($O$11+(($O$12-$O$11)*50/100),2)","v":{"$error":"#N/A"}},{"$f":"ROUND($O$15+(($O$16-$O$15)*50/100),2)","v":{"$error":"#REF!"}},{"$f":"ROUND(((P28-O28)*($N$4-$O$10))/($O$14-$O$10),2)","v":{"$error":"#REF!"}}]
[null,null,null,null,null,null,null,null,null,null,null,null,"Dreiviertelsatz",null,{"$f":"ROUND($O$11+(($O$12-$O$11)*75/100),2)","v":{"$error":"#N/A"}},{"$f":"ROUND($O$15+(($O$16-$O$15)*75/100),2)","v":{"$error":"#REF!"}},{"$f":"ROUND(((P29-O29)*($N$4-$O$10))/($O$14-$O$10),2)","v":{"$error":"#REF!"}}]

{"sheet":"Text","index":2,"n_rows":13,"n_cols":2,"rows_kept":13,"cut":false,"hidden":true,"merged":[]}
["Erhöhung Honorarzone",{"$f":"IF(Abfrage!G123=\"ja\",\"Ja, die Honorarzone wird erhöht.\",\"Es erfolgt keine Erhöhung der Honorarzone.\")","v":"Es erfolgt keine Erhöhung der Honorarzone."}]
["Begründung:",{"$f":"IF(Abfrage!G123=\"ja\",[0]!HZ_Begründung,\"---------\")","v":"---------"}]
[]
["Umbauzuschlag",{"$f":"IF(Abfrage!G137=\"ja\",\"Es wird ein Umbauzuschlag vereinbart.\",\"Es wird KEIN Zuschlag vereinbart.\")","v":"Es wird KEIN Zuschlag vereinbart."}]
["Begründung",{"$f":"IF(B4=\"Es wird kein Zuschlag vereinbart.\",\"----------\",Abfrage!A140)","v":"----------"}]
["Höhe",{"$f":"IF(B4=\"Es wird kein Zuschlag vereinbart.\",\"0\",Abfrage!D148)","v":"0"}]
["Betrag",{"$f":"IF(B4=\"Es wird kein Zuschlag vereinbart.\",\"0\",Abfrage!D149)","v":"0"}]
[]
["Besondere Leistungen",{"$f":"IF(Abfrage!G191=\"ja\",\"Es werden nach Anlage 1 eine oder mehrere Besondere Leistungen beauftragt.\",\"Es werden KEINE Besonderen Leistungen beauftragt.\")","v":"Es werden KEINE Besonderen Leistungen beauftragt."}]
["Honorar",{"$f":"IF(Abfrage!G191=\"ja\",Abfrage!F194,\"0\")","v":"0"}]
[]
["Sonstige Leistungen",{"$f":"IF(Abfrage!G198=\"ja\",\"Es werden nach Anlage 1 eine oder mehrere Beratungsleistungen beauftragt.\",\"Es werden KEINE Beratungsleistungen beauftragt.\")","v":"Es werden KEINE Beratungsleistungen beauftragt."}]
["Honorar",{"$f":"IF(Abfrage!G198=\"ja\",Abfrage!F201,\"0\")","v":"0"}]